{"text_format":"1","workbook":"xlsx","n_sheets":9,"sheets":["Ficha_Jerarquia","Valores","Clas_AT","DPA","Jerarquia","Calculos","RESUMEN DE RESULTADOS","ficha_Accesibilidad","Validación-GAD"],"not_rendered":{"charts":0,"images":3,"macros":1,"external_links":0,"defined_names":287,"comments":0,"pivot_tables":0},"unopened":[],"bounds":{"document_bytes":16777216,"sheet_cells":100000,"rows_first":2000,"rows_last":500,"rows_between":2000,"halvings":0,"cell_chars":16384,"cell_head_chars":4096},"cells_cut":0,"cells_raw":0,"read":"whole","date_system":"1900"}

{"sheet":"Ficha_Jerarquia","index":0,"n_rows":331,"n_cols":22,"rows_kept":331,"cut":false,"hidden":false,"merged":[[267,1,267,6],[269,1,269,6],[269,8,269,9],[268,1,268,6],[263,8,263,9],[266,8,266,9],[264,8,264,9],[263,1,263,6],[293,1,293,5],[293,15,293,20],[57,1,57,3],[57,4,57,21],[213,15,213,20],[213,4,213,10],[224,20,224,21],[259,16,259,21],[260,18,260,21],[271,18,271,21],[219,1,219,4],[219,6,219,10],[220,12,220,15],[220,17,220,20],[219,12,219,15],[220,1,220,4],[219,17,219,20],[220,6,220,10],[290,1,290,3],[290,4,290,21],[190,13,190,14],[190,11,190,12],[204,1,204,5],[204,8,204,21],[205,1,205,5],[205,8,205,21],[206,1,206,5],[206,8,206,21],[238,1,238,3],[231,1,231,3],[231,4,231,21],[238,13,238,15],[238,19,238,21],[236,17,236,19],[259,1,259,9],[259,14,259,15],[260,1,260,11],[260,16,260,17],[241,13,241,14],[241,16,241,21],[257,1,257,15],[246,16,246,21],[253,15,253,20],[216,8,216,13],[216,15,216,20],[215,1,215,21],[212,18,212,20],[251,1,251,6],[246,5,246,7],[247,4,247,21],[252,1,252,6],[250,1,250,6],[253,1,253,6],[224,1,224,10],[227,1,227,13],[238,5,238,7],[32,17,32,18],[32,11,32,13],[32,14,32,16],[289,10,289,11],[289,13,289,14],[111,14,111,16],[111,17,111,18],[249,1,249,21],[32,19,32,21],[278,5,279,5],[101,14,102,16],[101,17,102,18],[103,11,103,13],[109,4,109,7],[106,14,106,16],[112,17,112,18],[106,9,106,10],[104,14,104,16],[108,17,108,18],[110,14,110,16],[254,15,254,20],[114,17,114,18],[115,11,115,13],[115,14,115,16],[151,1,151,21],[289,16,289,17],[289,19,289,20],[289,1,289,2],[268,8,268,9],[203,1,203,5],[203,7,206,7],[203,8,203,21],[28,1,29,3],[115,17,115,18],[112,11,112,13],[262,9,262,16],[114,14,114,16],[113,11,113,13],[117,17,117,18],[118,11,118,13],[118,14,118,16],[116,14,116,16],[211,18,211,20],[212,12,212,13],[289,7,289,8],[289,4,289,5],[287,5,287,12],[287,15,287,21],[278,18,278,21],[287,1,287,4],[286,1,286,21],[279,18,279,21],[279,1,279,3],[281,6,281,8],[31,1,31,2],[29,6,29,7],[28,4,28,7],[29,8,29,10],[208,1,208,21],[217,1,217,3],[30,17,30,18],[81,12,81,14],[31,11,31,13],[31,14,31,16],[0,1,0,21],[2,5,2,6],[2,7,2,8],[2,9,2,10],[2,11,2,12],[2,13,2,14],[2,15,2,16],[2,17,2,18],[2,19,2,21],[1,1,2,4],[33,7,34,8],[3,1,3,21],[22,15,22,19],[23,1,23,21],[30,1,30,2],[4,1,4,21],[5,1,5,21],[13,1,13,7],[21,1,21,21],[29,4,29,5],[27,1,27,21],[29,19,29,21],[28,8,28,21],[30,4,30,5],[31,6,31,7],[32,4,32,5],[32,6,32,7],[30,8,30,10],[31,8,31,10],[32,8,32,10],[31,4,31,5],[30,6,30,7],[6,1,6,7],[6,8,6,14],[6,15,6,21],[12,1,12,7],[11,1,11,7],[7,15,7,21],[9,1,9,7],[11,17,11,21],[11,13,11,16],[11,8,11,12],[13,8,13,13],[9,15,9,21],[10,8,10,14],[10,15,10,21],[8,1,8,21],[13,15,13,21],[12,13,12,16],[12,8,12,12],[12,17,12,21],[10,1,10,7],[7,1,7,7],[7,8,7,14],[9,8,9,14],[34,1,34,2],[14,1,14,7],[14,8,14,14],[14,15,14,21],[22,1,22,2],[32,1,32,2],[22,13,22,14],[22,10,22,12],[22,3,22,9],[22,20,22,21],[189,13,189,14],[189,15,189,18],[190,3,190,8],[190,9,190,10],[216,1,216,6],[31,17,31,18],[31,19,31,21],[30,14,30,16],[29,11,29,13],[29,14,29,16],[29,17,29,18],[30,11,30,13],[35,7,35,21],[40,1,40,3],[40,4,40,21],[36,1,36,3],[26,12,26,13],[26,14,26,15],[44,20,44,21],[48,12,48,13],[48,14,48,16],[189,1,190,2],[66,1,66,21],[45,17,45,19],[136,1,136,4],[52,1,52,3],[48,17,48,18],[45,5,45,7],[48,9,48,10],[45,9,45,11],[48,20,48,21],[185,3,185,8],[185,9,185,10],[185,11,185,12],[185,13,185,14],[117,11,117,13],[110,17,110,18],[116,17,116,18],[162,3,162,11],[101,4,102,8],[101,9,102,10],[106,4,106,7],[135,12,135,15],[111,4,111,7],[111,9,111,10],[115,9,115,10],[45,15,45,16],[79,5,79,7],[76,12,76,14],[52,4,52,21],[64,1,64,6],[64,7,64,9],[70,16,70,17],[70,12,70,13],[44,15,44,16],[44,17,44,19],[196,16,200,16],[196,1,196,3],[197,12,197,14],[198,12,198,14],[190,15,190,18],[197,6,197,11],[152,4,152,6],[117,14,117,16],[123,12,123,14],[123,16,123,18],[124,12,124,13],[124,14,124,21],[122,12,122,15],[126,1,126,15],[128,6,128,8],[118,17,118,18],[131,7,131,21],[118,1,118,3],[118,9,118,10],[117,4,117,7],[131,1,131,6],[130,1,130,21],[134,1,134,4],[134,5,134,6],[128,1,128,3],[128,20,128,21],[189,9,189,10],[192,3,192,21],[189,11,189,12],[45,12,45,14],[70,1,70,6],[137,7,137,8],[78,12,78,14],[136,5,136,6],[77,5,77,7],[101,1,102,3],[108,14,108,16],[109,9,109,10],[109,11,109,13],[109,14,109,16],[101,11,102,13],[68,1,68,3],[70,18,70,19],[70,10,70,11],[75,10,75,11],[75,5,75,7],[68,4,68,21],[111,11,111,13],[107,11,107,13],[110,4,110,7],[107,4,107,7],[107,9,107,10],[124,1,124,2],[137,1,137,4],[137,9,137,21],[70,8,70,9],[86,10,86,11],[87,5,87,7],[94,1,94,5],[83,1,83,3],[128,15,128,16],[133,1,133,4],[129,1,129,3],[133,7,133,10],[133,12,133,15],[135,7,135,10],[136,7,136,10],[136,12,136,15],[129,4,129,21],[136,17,136,20],[116,4,116,7],[116,9,116,10],[112,1,115,3],[112,4,112,7],[99,1,99,3],[103,9,103,10],[105,4,105,7],[104,4,104,7],[104,9,104,10],[105,9,105,10],[101,19,101,21],[108,1,111,3],[108,4,108,7],[108,9,108,10],[103,1,107,3],[103,4,103,7],[109,17,109,18],[110,11,110,13],[103,17,103,18],[104,11,104,13],[115,4,115,7],[112,9,112,10],[140,1,140,3],[140,4,140,5],[140,11,140,14],[146,1,146,4],[97,10,97,11],[148,17,148,20],[146,5,146,6],[145,5,145,6],[146,7,146,10],[140,20,140,21],[145,17,145,20],[146,17,146,20],[147,12,147,15],[148,7,148,10],[147,17,147,20],[142,1,142,21],[145,12,145,15],[128,9,128,10],[114,4,114,7],[117,9,117,10],[113,4,113,7],[113,9,113,10],[124,3,124,11],[127,1,127,21],[116,1,117,3],[116,11,116,13],[119,1,119,3],[119,4,119,21],[132,1,132,4],[132,5,132,6],[138,4,138,21],[133,5,133,6],[59,14,60,21],[133,17,133,20],[134,17,134,20],[125,1,125,3],[125,4,125,21],[135,1,135,4],[98,10,98,11],[135,17,135,20],[144,5,144,6],[143,1,143,6],[138,1,138,3],[132,7,132,10],[134,12,134,15],[128,11,128,14],[135,5,135,6],[144,1,144,4],[139,1,139,21],[144,12,144,15],[128,17,128,19],[106,17,106,18],[98,15,98,16],[98,17,98,18],[97,6,97,7],[97,8,97,9],[140,17,140,19],[63,7,63,9],[95,18,95,21],[83,8,83,9],[94,12,94,16],[86,18,86,19],[92,18,92,21],[93,12,93,16],[15,1,15,21],[98,1,98,2],[98,4,98,5],[98,6,98,7],[98,8,98,9],[44,12,44,14],[42,4,45,4],[45,20,45,21],[43,20,43,21],[70,20,70,21],[182,3,182,8],[160,14,160,21],[161,12,161,14],[162,12,162,13],[162,14,162,21],[161,16,161,21],[165,4,165,21],[160,3,160,11],[158,1,158,2],[174,13,174,14],[174,15,174,18],[180,3,180,8],[169,13,169,14],[159,5,159,11],[161,5,161,11],[159,16,159,21],[161,1,161,3],[153,4,153,21],[152,20,152,21],[152,1,152,3],[153,1,153,3],[152,15,152,17],[267,8,267,9],[275,1,275,6],[255,1,255,6],[255,8,255,13],[265,1,265,6],[265,8,265,9],[242,1,242,3],[242,4,242,21],[262,1,262,6],[97,1,97,2],[97,4,97,5],[245,9,245,11],[239,1,239,3],[239,4,239,21],[200,6,200,11],[189,3,189,8],[148,12,148,15],[156,12,156,21],[187,3,187,8],[144,7,144,10],[241,1,241,3],[241,5,241,7],[241,9,241,11],[240,1,240,21],[238,9,238,11],[195,1,195,11],[197,1,197,3],[198,1,198,3],[207,1,207,3],[207,4,207,21],[237,1,237,3],[237,5,237,7],[261,17,261,21],[43,9,43,11],[43,12,43,14],[252,15,252,20],[246,9,246,11],[258,1,258,21],[254,8,254,13],[245,17,245,19],[43,5,43,7],[145,1,145,4],[152,10,152,12],[158,12,158,13],[158,14,158,21],[160,12,160,13],[159,12,159,14],[155,1,155,21],[157,5,157,11],[157,16,157,21],[158,3,158,11],[157,12,157,14],[159,1,159,3],[43,17,43,19],[44,9,44,11],[177,1,188,2],[178,3,178,8],[217,4,217,21],[188,3,188,8],[183,3,183,8],[95,7,95,11],[43,15,43,16],[92,7,92,11],[154,1,154,15],[235,1,235,3],[225,1,225,11],[221,10,221,12],[237,9,237,11],[237,13,237,15],[228,1,228,21],[237,17,237,19],[44,5,44,7],[152,7,152,9],[229,1,229,13],[182,9,182,10],[212,4,212,6],[104,17,104,18],[105,11,105,13],[105,14,105,16],[105,17,105,18],[106,11,106,13],[152,13,152,14],[152,18,152,19],[156,1,156,11],[150,1,150,3],[150,4,150,21],[132,12,132,15],[149,7,149,8],[149,9,149,21],[140,6,140,8],[170,3,170,8],[170,9,170,10],[171,9,171,10],[172,9,172,10],[167,9,167,18],[168,9,168,10],[261,8,261,16],[272,1,272,3],[264,1,264,6],[271,16,271,17],[294,1,294,2],[278,17,279,17],[285,1,285,3],[285,4,285,21],[278,1,278,3],[266,1,266,6],[165,1,165,3],[146,12,146,15],[175,3,175,8],[281,1,281,5],[273,1,273,15],[279,6,279,16],[277,1,277,21],[278,6,278,16],[245,5,245,7],[261,1,261,7],[255,17,255,21],[244,17,244,19],[246,1,246,3],[244,5,244,7],[244,1,244,3],[246,13,246,14],[247,1,247,3],[245,13,245,15],[251,15,251,20],[252,8,252,13],[253,8,253,13],[254,1,254,6],[324,1,324,3],[303,1,303,21],[304,1,309,10],[304,11,309,21],[310,1,310,2],[310,3,310,21],[271,1,271,11],[270,1,270,3],[270,4,270,21],[282,1,284,3],[299,1,301,21],[297,1,297,3],[297,4,297,21],[296,15,296,16],[294,20,294,21],[295,20,295,21],[276,1,276,8],[287,13,287,14],[288,1,288,9],[288,10,288,21],[282,4,282,5],[282,6,282,8],[275,19,275,21],[274,1,274,21],[280,1,280,21],[296,20,296,21],[302,1,302,21],[298,1,298,21],[284,19,284,21],[283,4,283,5],[283,16,283,18],[283,19,283,21],[330,15,330,17],[329,18,329,21],[329,15,329,17],[326,15,326,17],[326,18,326,21],[330,1,330,3],[330,4,330,7],[330,8,330,10],[330,11,330,14],[329,4,329,7],[330,18,330,21],[329,1,329,3],[327,4,327,7],[329,8,329,10],[329,11,329,14],[328,1,328,3],[328,4,328,7],[328,8,328,10],[328,11,328,14],[327,18,327,21],[326,11,326,14],[327,1,327,3],[327,8,327,10],[327,11,327,14],[256,1,256,3],[256,4,256,21],[251,8,251,13],[328,18,328,21],[328,15,328,17],[325,18,325,21],[327,15,327,17],[326,1,326,3],[326,4,326,7],[326,8,326,10],[324,4,324,7],[324,8,324,10],[324,11,324,14],[324,15,324,17],[324,18,324,21],[325,1,325,3],[325,4,325,7],[325,8,325,10],[325,11,325,14],[325,15,325,17],[311,1,311,21],[312,1,320,21],[321,1,321,2],[321,3,321,21],[323,8,323,14],[323,15,323,21],[322,1,322,21],[323,1,323,7],[296,3,296,6],[294,4,294,5],[295,1,295,2],[295,4,295,5],[168,11,168,12],[245,1,245,3],[244,9,244,11],[244,13,244,15],[181,3,181,8],[167,19,167,21],[209,1,209,11],[209,12,209,21],[167,1,168,2],[171,3,171,8],[148,1,148,4],[148,5,148,6],[140,15,140,16],[147,1,147,4],[147,5,147,6],[141,1,141,3],[141,4,141,21],[192,1,192,2],[195,12,195,21],[193,4,193,21],[193,1,193,3],[196,6,196,11],[196,17,196,21],[169,15,169,18],[168,15,168,18],[169,9,169,10],[170,11,170,12],[169,11,169,12],[172,11,172,12],[172,13,172,14],[172,15,172,18],[171,11,171,12],[51,8,51,9],[120,1,120,21],[114,9,114,10],[171,15,171,18],[170,13,170,14],[170,15,170,18],[58,1,58,21],[55,13,55,14],[89,8,89,9],[54,20,54,21],[186,3,186,8],[181,15,181,18],[162,1,162,2],[140,9,140,10],[143,7,143,21],[169,3,169,8],[174,3,174,8],[174,9,174,10],[62,7,62,9],[145,7,145,10],[128,4,128,5],[64,14,64,21],[181,11,181,12],[90,18,90,19],[90,20,90,21],[95,1,95,5],[71,1,71,3],[75,12,75,14],[184,3,184,8],[132,17,132,20],[134,7,134,10],[149,1,149,4],[171,13,171,14],[168,13,168,14],[172,3,172,8],[167,3,168,8],[26,9,26,11],[62,14,62,21],[54,15,54,16],[147,7,147,10],[34,9,34,11],[34,13,34,16],[34,18,34,20],[89,15,89,17],[54,11,54,12],[59,10,59,13],[53,1,53,21],[47,12,47,13],[47,14,47,16],[47,17,47,18],[47,19,49,19],[47,20,47,21],[48,4,48,5],[48,7,48,8],[51,1,51,2],[55,11,55,12],[55,4,55,5],[78,5,78,7],[61,14,61,21],[63,14,63,21],[61,7,61,9],[59,7,60,9],[65,7,65,9],[65,14,65,21],[179,13,179,14],[179,15,179,18],[180,13,180,14],[182,13,182,14],[180,15,180,18],[182,15,182,18],[177,9,177,10],[177,11,177,12],[177,13,177,14],[177,15,177,18],[178,15,178,18],[179,9,179,10],[173,13,173,14],[176,9,176,10],[176,11,176,12],[176,13,176,14],[176,15,176,18],[173,9,173,10],[173,11,173,12],[175,9,175,10],[175,11,175,12],[175,13,175,14],[175,15,175,18],[174,11,174,12],[173,15,173,18],[182,11,182,12],[179,11,179,12],[183,11,183,12],[183,13,183,14],[178,9,178,10],[178,11,178,12],[178,13,178,14],[181,13,181,14],[55,20,55,21],[88,15,88,17],[96,15,96,21],[73,1,73,21],[84,18,84,19],[180,9,180,10],[90,5,90,7],[83,5,83,7],[65,1,65,6],[180,11,180,12],[183,15,183,18],[98,19,98,20],[86,12,86,13],[81,5,81,7],[87,15,87,17],[87,18,87,19],[121,12,121,21],[87,1,87,3],[82,1,82,3],[82,5,82,7],[84,8,84,9],[83,10,83,11],[84,10,84,11],[86,8,86,9],[85,12,85,14],[81,1,81,3],[35,1,35,6],[36,4,36,21],[47,1,49,3],[47,4,47,5],[42,17,42,19],[236,9,236,11],[236,13,236,15],[234,1,234,21],[233,1,233,21],[42,15,42,16],[56,4,56,5],[177,3,177,8],[188,9,188,10],[47,7,47,8],[42,12,42,14],[42,9,42,11],[42,1,45,3],[42,5,42,8],[169,1,176,2],[166,1,166,21],[110,9,110,10],[56,1,56,2],[144,17,144,20],[123,5,123,7],[38,1,38,14],[188,11,188,12],[188,13,188,14],[188,15,188,18],[187,9,187,10],[173,3,173,8],[89,5,89,7],[89,10,89,11],[229,18,229,21],[230,1,230,21],[51,15,51,16],[56,7,56,8],[99,4,99,11],[61,1,61,6],[63,1,63,6],[83,12,83,14],[84,12,84,14],[83,20,83,21],[47,9,47,10],[47,11,49,11],[39,20,39,21],[250,8,250,13],[250,15,250,20],[235,5,235,7],[235,9,235,11],[235,13,235,15],[235,17,235,19],[236,5,236,7],[88,5,88,7],[88,8,88,9],[88,10,88,11],[88,12,88,14],[54,13,54,14],[123,1,123,3],[59,1,60,6],[69,1,69,21],[62,1,62,6],[71,4,71,21],[122,17,122,20],[87,20,87,21],[38,15,38,21],[41,1,41,21],[55,1,55,2],[55,18,55,19],[54,18,54,19],[191,3,191,8],[88,1,88,3],[89,1,89,3],[122,1,122,4],[96,1,96,3],[118,4,118,8],[91,4,91,11],[123,9,123,10],[191,11,191,12],[191,9,191,10],[187,11,187,12],[187,13,187,14],[187,15,187,18],[99,12,99,14],[179,3,179,8],[191,1,191,2],[183,9,183,10],[83,18,83,19],[122,7,122,10],[70,14,70,15],[84,5,84,7],[85,4,85,11],[54,1,54,2],[54,4,54,5],[107,14,107,16],[107,17,107,18],[108,11,108,13],[281,11,281,15],[281,16,281,18],[281,19,281,21],[282,16,282,18],[281,9,281,10],[282,9,282,10],[282,11,284,13],[42,20,42,21],[282,14,282,15],[283,6,283,8],[283,9,283,10],[283,14,283,15],[227,18,227,21],[225,18,225,21],[226,1,226,21],[243,1,243,21],[272,4,272,21],[49,14,49,16],[100,1,100,21],[99,15,99,21],[49,17,49,18],[85,15,85,21],[87,8,87,9],[87,10,87,11],[49,7,49,8],[95,12,95,16],[191,13,191,14],[96,4,96,11],[97,19,97,20],[88,18,88,19],[89,18,89,19],[121,1,121,11],[296,7,296,9],[296,13,296,14],[293,7,293,14],[294,11,294,12],[295,11,295,12],[294,13,294,14],[295,13,295,14],[37,1,37,15],[72,1,72,15],[232,1,232,15],[248,1,248,21],[291,1,291,15],[268,10,268,16],[46,4,46,21],[49,20,49,21],[49,4,49,5],[218,1,218,21],[282,19,282,21],[49,9,49,10],[295,18,295,19],[294,18,294,19],[295,15,295,16],[294,15,294,16],[294,7,294,9],[295,7,295,9],[97,17,97,18],[264,10,264,16],[284,4,284,5],[284,6,284,8],[284,9,284,10],[284,14,284,15],[284,16,284,18],[24,1,24,6],[24,8,24,13],[24,15,24,20],[33,9,33,10],[33,12,33,13],[33,15,33,16],[26,1,26,2],[26,3,26,4],[26,5,26,6],[26,20,26,21],[18,1,18,4],[18,5,18,10],[18,11,18,14],[18,15,18,21],[19,1,19,3],[19,4,19,21],[16,1,16,4],[16,5,16,10],[16,11,16,14],[16,15,16,21],[17,1,17,4],[17,5,17,10],[17,11,17,14],[17,15,17,21],[33,18,33,20],[26,16,26,17],[26,18,26,19],[26,7,26,8],[25,1,25,21],[33,1,33,6],[20,1,20,21],[30,19,30,21]],"merged_total":1192,"flags":["merged_cut"]}
[null,"FICHA  PARA EL LEVANTAMIENTO Y JERARQUIZACIÓN DE ATRACTIVOS TURÍSTICOS"]
[null,"Código del atractivo:",null,null,null,{"$f":"INDEX(DPA!A2:C26,MATCH(B11,DPA!A2:A26,0),2)","v":1},{"$f":"INDEX(DPA!A2:C26,MATCH(B11,DPA!A2:A26,0),3)","v":0},{"$f":"INDEX(DPA!A29:C255,MATCH(I11,DPA!A29:A255,0),2)","v":0},{"$f":"INDEX(DPA!A29:C255,MATCH(I11,DPA!A29:A255,0),3)","v":1},{"$f":"INDEX(DPA!A258:C1507,MATCH(P11,DPA!A258:A1507,0),2)","v":5},{"$f":"INDEX(DPA!A258:C1507,MATCH(P11,DPA!A258:A1507,0),3)","v":1},{"$f":"IF(B8=\"ATRACTIVOS_NATURALES\",\"A\",IF(B8=\"MANIFESTACIONES_CULTURALES\",\"M\",0))","v":"M"},{"$f":"IF(B8=\"ATRACTIVOS_NATURALES\",\"N\",IF(B8=\"MANIFESTACIONES_CULTURALES\",\"C\",0))","v":"C"},{"$f":"INDEX(Clas_AT!A2:C16,MATCH(I8,Clas_AT!A2:A16,0),2)","v":"0"},{"$f":"INDEX(Clas_AT!A2:C16,MATCH(I8,Clas_AT!A2:A16,0),3)","v":4},{"$f":"INDEX(Clas_AT!A19:C97,MATCH(P8,Clas_AT!A19:A97,0),2)","v":"0"},{"$f":"INDEX(Clas_AT!A19:C97,MATCH(P8,Clas_AT!A19:A97,0),3)","v":1},{"$f":"IF(M2=\"SITIOS\",1,0)","v":0},{"$f":"IF(AND(Jerarquia!C1>=11,Jerarquia!C1<=35),1,IF(AND(Jerarquia!C1>=36,Jerarquia!C1<=60),2,IF(AND(Jerarquia!C1>=61,Jerarquia!C1<=85),3,IF(AND(Jerarquia!C1>=86,Jerarquia!C1<=100),4,0))))","v":1},0,0,1]
[null,null,null,null,null,"Provincia",null,"Cantón",null,"Parroquia",null,"Categoría",null,"Tipo",null,"Subtipo",null,"Jerarquía",null,"Atractivo"]
[null,"1. DATOS GENERALES"]
[null,"1.1 Nombre del Atractivo Turístico"]
[null,"CARNAVAL OLAS DEL RÍO"]
[null,"1.2 Categoría",null,null,null,null,null,null,"1.3 Tipo",null,null,null,null,null,null,"1.4 Subtipo"]
[null,"MANIFESTACIONES_CULTURALES",null,null,null,null,null,null,"ACONTECIMIENTOS_PROGRAMADOS",null,null,null,null,null,null,"EVENTOS ARTÍSTICOS"]
{"$rows_left_out":324}
{"sheet":"Valores","index":1,"n_rows":114,"n_cols":227,"rows_kept":114,"cut":false,"hidden":true,"merged":[]}
[]
["CATEGORIA","ATRACTIVOS_NATURALES","MANIFESTACIONES_CULTURALES","MONTAÑAS","PLANICIES","AMBIENTES_LACUSTRES","RÍOS","BOSQUES","AGUAS_SUBTERRÁNEAS","FENÓMENOS_ESPELEOLÓGICOS","FENÓMENOS_GEOLÓGICOS","COSTAS_O_LITORALES","AMBIENTES_MARINOS","TIERRAS_INSULARES","ARQUITECTURA","ACERVO_CULTURAL_Y_POPULAR","REALIZACIONES_TÉCNICAS_Y_CIENTÍFICAS","ACONTECIMIENTOS_PROGRAMADOS"]
["ATRACTIVOS_NATURALES","MONTAÑAS","ARQUITECTURA","ALTA MONTAÑA","COSTERO","LAGO","RÍO","EN PÁRAMO","MANANTIAL  DE AGUA MINERAL","CUEVA O CAVERNA","FLUJO DE LAVA","PLAYA","ARRECIFE DE CORAL","ISLA CONTINENTAL","HISTÓRICA / VERNÁCULA","PUEBLO Y/O NACIONALIDAD (ETNOGRAFÍA)","OBRAS DE INGENIERÍA","EVENTOS ARTÍSTICOS"]
["MANIFESTACIONES_CULTURALES","DESIERTOS","ACERVO_CULTURAL_Y_POPULAR","MEDIA MONTAÑA","DEL INTERIOR","LAGUNA","RIACHUELO ","CEJA DE SELVA","MANANTIAL DE AGUA TERMAL","RÍO SUBTERRÁNEO","TUBO DE LAVA","ACANTILADO","CUEVA","ISLA OCEÁNICA","INFRAESTRUCTURA CULTURAL","FIESTAS RELIGIOSAS, TRADICIONES Y CREENCIAS POPULARES","CENTROS ASTRONÓMICOS","CONVENCIONES, FERIAS (NO ARTESANALES) Y CONGRESOS"]
[null,"AMBIENTES_LACUSTRES","REALIZACIONES_TÉCNICAS_Y_CIENTÍFICAS","BAJA MONTAÑA",null,"PANTANO","RÁPIDO","NUBLADO",null,null,"ESCARPA DE FALLA (PLIEGUE)","GOLFO","CRÁTER","ISLOTE","INFRAESTRUCTURA RECREATIVA","ARTESANÍAS Y ARTES","CENTROS DE EXHIBICIÓN DE FLORA Y FAUNA","EVENTOS DEPORTIVOS"]
[null,"RÍOS","ACONTECIMIENTOS_PROGRAMADOS",null,null,"POZA","CASCADA","MONTANO BAJO",null,null,"CAÑÓN","BAHÍA","ACANTILADO","ROCA","OTRAS INFRAESTRUCTURAS SOCIALES","MEDICINA ANCESTRAL","CENTROS DE RECATE DE FAUNA SILVESTRE","EVENTOS GASTRONÓMICOS"]
[null,"BOSQUES",null,null,null,"HUMEDAL","RIBERA","HÚMEDO TROPICAL",null,null,"QUEBRADA","ENSENADA",null,null,"ÁREA HISTÓRICA","FERIAS Y MERCADOS","CENTROS AGROPECUARIOS Y PESQUEROS"]
[null,"AGUAS_SUBTERRÁNEAS",null,null,null,"VADO","PLAYA DE RÍO","MANGLAR",null,null,"GRIETA","CANAL",null,null,"ÁREA ARQUEOLÓGICA","MÚSICA Y DANZA","CENTROS INDUSTRIALES"]
{"$rows_left_out":107}
{"sheet":"Clas_AT","index":2,"n_rows":97,"n_cols":3,"rows_kept":97,"cut":false,"hidden":true,"merged":[]}
["TIPO","COD1","COD2"]
["MONTAÑAS","0",1]
["DESIERTOS","0","2"]
["AMBIENTES_LACUSTRES","0","3"]
["RÍOS","0","4"]
["BOSQUES","0","5"]
["AGUAS_SUBTERRÁNEAS","0","6"]
["FENÓMENOS_ESPELEOLÓGICOS","0","7"]
{"$rows_left_out":90}
{"sheet":"DPA","index":3,"n_rows":1507,"n_cols":3,"rows_kept":1507,"cut":false,"hidden":true,"merged":[]}
["PROVINCIA","COD1","COD2"]
["AZUAY",0,1]
["BOLIVAR",0,2]
["CAÑAR",0,3]
["CARCHI",0,4]
["COTOPAXI",0,5]
["CHIMBORAZO",0,6]
["EL_ORO",0,7]
{"$rows_left_out":1500}
{"sheet":"Jerarquia","index":4,"n_rows":96,"n_cols":4,"rows_kept":96,"cut":false,"hidden":true,"merged":[[4,2,6,2],[0,0,0,1],[2,0,2,1],[16,0,16,1],[34,0,34,1],[45,0,45,1],[61,0,61,1],[88,0,88,1],[68,0,68,2],[69,0,69,1],[76,0,76,1],[82,0,82,1]]}
["JERARQUIZACIÓN DE ATRACIVOS TURÍSTICOS",null,{"$f":"SUM(C3,C17,C35,C46,C62,C70,C77,C83,C89)","v":28.6}]
[]
["ACCESIBILIDAD AL ATRACTIVO TURÍSTICO",null,{"$f":"SUM(C5:C15)","v":14}]
["CELDA","RAZÓN","VALOR"]
[2329,"Terrestre",{"$f":"Calculos!I18","v":9}]
[2330,"Acuático"]
[2331,"Aéreo"]
["D68",true,{"$f":"IF(B8=TRUE,2,0)","v":2}]
{"$rows_left_out":89}
{"sheet":"Calculos","index":5,"n_rows":20,"n_cols":14,"rows_kept":20,"cut":false,"hidden":true,"merged":[[0,0,0,5],[5,0,5,8],[10,0,10,1]]}
["TERRESTRE"]
["Detalle","V. Asignado","Suma","3 Datos","2 Datos","1 Datos",null,null,null,null,"Acción","Valor","Media","Resultado"]
[{"$f":"Ficha_Jerarquia!U44","v":"Bueno"},{"$f":"IF(A3=\"Bueno\",3,IF(A3=\"Regular\",2,IF(A3=\"Malo\",1,0)))","v":3},{"$f":"B3+B4+B5","v":3},{"$f":"C3*9/9","v":3},null,null,null,null,null,null,true,{"$f":"IF(K3=TRUE,1,0)","v":1},{"$f":"SUM(L3:L5)","v":1},{"$f":"IF(M3=3,D3,IF(M3=2,E4,IF(M3=1,F5,0)))","v":9}]
[{"$f":"Ficha_Jerarquia!U45","v":0},{"$f":"IF(A4=\"Bueno\",3,IF(A4=\"Regular\",2,IF(A4=\"Malo\",1,0)))","v":0},null,null,{"$f":"C3*9/6","v":4.5},null,null,null,null,null,false,{"$f":"IF(K4=TRUE,1,0)","v":0}]
[{"$f":"Ficha_Jerarquia!U46","v":0},{"$f":"IF(A5=\"Bueno\",3,IF(A5=\"Regular\",2,IF(A5=\"Malo\",1,0)))","v":0},null,null,null,{"$f":"C3*9/3","v":9},null,null,null,null,false,{"$f":"IF(K5=TRUE,1,0)","v":0}]
["ACUÁTICO"]
["Detalle","V. Asignado","Detalle","V.Asignado","Promedio","Suma","3 Datos","2 Datos","1 Datos",null,"Acción","Valor","Media","Resultado"]
[{"$f":"Ficha_Jerarquia!M48","v":0},{"$f":"IF(A8=\"Bueno\",3,IF(A8=\"Regular\",2,IF(A8=\"Malo\",1,0)))","v":0},{"$f":"Ficha_Jerarquia!U48","v":0},{"$f":"IF(C8=\"Bueno\",3,IF(C8=\"Regular\",2,IF(C8=\"Malo\",1,0)))","v":0},{"$f":"(B8+D8)/2","v":0},{"$f":"E8+E9+E10","v":0},{"$f":"F8*9/9","v":0},null,null,null,false,{"$f":"IF(K8=TRUE,1,0)","v":0},{"$f":"SUM(L8:L10)","v":0},{"$f":"IF(M8=3,G8,IF(M8=2,H9,IF(M8=1,I10,0)))","v":0}]
{"$rows_left_out":13}
{"sheet":"RESUMEN DE RESULTADOS","index":6,"n_rows":12,"n_cols":5,"rows_kept":12,"cut":false,"hidden":false,"merged":[[0,0,0,4],[1,0,1,1],[11,0,11,2]]}
["RESULTADOS DE LA EVALUACIÓN TÉCNICA"]
["CRITERIOS DE VALORACIÓN",null,"DESCRIPCIÓN","PONDERACIÓN","RESULTADO"]
["A","ACCESIBILIDAD y CONECTIVIDAD","Contempla el ingreso, horario al atractivo y   facilidades instaladas para personas con alguna discapacidad; además,  se  hace  referencia a  la  existencia de  vías  de acceso al sitio, con énfasis en las cualidades que condicionan la relación distancia/tiempo, así también la conectividad tecnológica.",18,{"$f":"Jerarquia!C3","v":14}]
["B","PLANTA TURÍSTICA / SERVICIOS","Registra equipamientos y  la disponibilidad de servicios en el atractivo.",18,{"$f":"Jerarquia!C17","v":8.1}]
["C","ESTADO        DE        CONSERVACIÓN        E INTEGRACIÓN SITIO / ENTORNO","Estimación de la integridad de los atributos patrimoniales físico-ambientales y socioculturales, en particular de las condiciones del sitio y su entorno.",14,{"$f":"Jerarquia!C35","v":5}]
["D","HIGIENE Y SEGURIDAD TURÍSTICA","Hace referencia a la disponibilidad de dispositivos para recolección de basura, procedencia del agua,   presencia de actos vandálicos, limpieza e iluminación del atractivo.",14,{"$f":"Jerarquia!C46","v":1.5}]
["E","POLÍTICAS Y REGULACIONES","Consideración  del  atractivo  dentro  de  la  Planificación territorial turística cantonal y cumplimiento de regulaciones para las actividades que se realizan en el atractivo.",10,{"$f":"Jerarquia!C62","v":0}]
["F","ACTIVIDADES  QUE  SE  PRACTICAN  EN  EL ATRACTIVO","Constatación  de  actividades  que  se  practican  en  el atractivo, mismas que le dan valor agregado.",9,{"$f":"Jerarquia!C70","v":0}]
{"$rows_left_out":5}
{"sheet":"ficha_Accesibilidad","index":7,"n_rows":73,"n_cols":13,"rows_kept":73,"cut":false,"hidden":false,"merged":[[72,0,74,4],[72,5,74,7],[72,8,74,12],[61,0,61,9],[62,0,69,12],[70,0,71,1],[70,2,71,4],[70,5,70,7],[70,8,70,12],[71,5,71,7],[71,8,71,12],[60,0,60,9],[49,0,49,9],[50,0,50,9],[51,0,51,9],[52,0,52,9],[53,0,53,9],[54,0,54,9],[55,0,55,9],[56,0,56,9],[57,0,57,9],[58,0,58,9],[59,0,59,9],[48,0,48,9],[37,0,37,9],[38,0,38,9],[39,0,39,9],[40,0,40,9],[41,0,41,9],[42,0,42,9],[43,0,43,9],[44,0,44,9],[45,0,45,9],[46,0,46,9],[47,0,47,9],[36,0,36,9],[25,0,25,9],[26,0,26,9],[27,0,27,9],[28,0,28,9],[29,0,29,9],[30,0,30,9],[31,0,31,9],[32,0,32,9],[33,0,33,9],[34,0,34,9],[35,0,35,9],[24,0,24,9],[13,0,13,9],[14,0,14,9],[15,0,15,9],[16,0,16,9],[17,0,17,9],[18,0,18,9],[19,0,19,9],[20,0,20,9],[21,0,21,9],[22,0,22,9],[23,0,23,9],[12,0,12,9],[0,0,3,12],[4,0,4,12],[4,18,4,23],[4,24,4,29],[5,0,5,12],[6,0,6,9],[7,0,7,9],[8,0,8,9],[9,0,9,9],[10,0,10,9],[11,0,11,9]]}
[]
[]
[]
[]
["4.- CARACTERÍSTICAS  DEL ATRACTIVO (infraestructura)"]
["ACCESIBILIDAD:"]
["General",null,null,null,null,null,null,null,null,null,"SI","NO","OBSERVACIONES"]
["Estacionamiento",null,null,null,null,null,null,null,null,null,"X"]
{"$rows_left_out":66}
{"sheet":"Validación-GAD","index":8,"n_rows":24,"n_cols":7,"rows_kept":24,"cut":false,"hidden":false,"merged":[[20,6,21,9],[16,1,16,5],[15,1,15,5],[18,1,18,5],[15,6,15,9],[16,6,16,9],[17,6,17,9],[18,6,18,9],[19,6,19,9],[23,1,25,9],[5,1,5,9],[7,1,7,9],[9,6,9,9],[9,2,9,3],[10,2,10,3],[11,2,11,3],[10,4,10,5],[11,4,11,5],[10,6,10,9],[11,6,11,9],[21,3,21,5],[20,1,20,5],[14,1,14,9],[17,1,17,5],[19,1,19,5]]}
["Nota: Se completa esta sección en el caso que el GAD no haya levantado directamente la ficha de atractivos."]
[]
[]
[]
[]
[null,"VALIDACIÓN DE FICHA  PARA EL LEVANTAMIENTO Y JERARQUIZACIÓN DE ATRACTIVOS TURÍSTICOS"]
[]
[null,"Datos del Atractivo"]
{"$rows_left_out":16}